{"text_format":"1","workbook":"xlsx","n_sheets":5,"sheets":["ALESAGES","Arbres","Calcul ajustement","Calcul courbes","Graphique1"],"not_rendered":{"charts":1,"images":0,"macros":1,"external_links":0,"defined_names":28,"comments":0,"pivot_tables":0},"unopened":[],"bounds":{"document_bytes":16777216,"sheet_cells":100000,"rows_first":2000,"rows_last":500,"rows_between":2000,"halvings":0,"cell_chars":16384,"cell_head_chars":4096},"cells_cut":0,"cells_raw":0,"read":"whole","date_system":"1900"}

{"sheet":"ALESAGES","index":0,"n_rows":44,"n_cols":15,"rows_kept":44,"cut":false,"hidden":false,"merged":[[20,0,21,0],[10,0,11,0],[12,0,13,0],[14,0,15,0],[16,0,17,0],[18,0,19,0],[26,0,27,0],[0,0,1,1],[38,0,39,0],[40,0,41,0],[42,0,43,0],[24,0,25,0],[28,0,29,0],[30,0,31,0],[32,0,33,0],[34,0,35,0],[36,0,37,0],[22,0,23,0],[2,0,3,0],[4,0,5,0],[6,0,7,0],[8,0,9,0]]}
["ALESAGES",null,"≤ 3","3<D≤6","6<D≤10","10<D≤18","18<D≤30","30<D≤50","50<D≤80","80<D≤120","120<D≤180","180<D≤250","250<D≤315","315<D≤400","400<D≤500"]
[null,null,3,6,10,18,30,50,80,120,180,250,315,400,500]
["D10","Maxi",0.06,7.8E-2,9.8000000000000004E-2,0.12,0.14899999999999999,0.18,0.22,0.26,0.30499999999999999,0.35499999999999998,0.4,0.44,0.48]
[null,"Mini",0.02,0.03,0.04,0.05,6.5000000000000002E-2,0.08,0.1,0.12,0.14499999999999999,0.17,0.19,0.21,0.23]
["F7","Maxi",1.6E-2,2.1999999999999999E-2,2.8000000000000001E-2,3.4000000000000002E-2,4.1000000000000002E-2,0.05,0.06,7.0999999999999994E-2,8.3000000000000004E-2,9.6000000000000002E-2,0.108,0.11899999999999999,0.13100000000000001]
[null,"Mini",6.0000000000000001E-3,0.01,1.2999999999999999E-2,1.6E-2,0.02,2.5000000000000001E-2,0.03,3.5999999999999997E-2,4.2999999999999997E-2,0.05,5.6000000000000001E-2,6.2E-2,6.8000000000000005E-2]
["G6","Maxi",8.0000000000000002E-3,1.2E-2,1.4E-2,1.7000000000000001E-2,0.02,2.5000000000000001E-2,2.9000000000000001E-2,3.4000000000000002E-2,3.9E-2,4.3999999999999997E-2,4.9000000000000002E-2,5.3999999999999999E-2,0.06]
[null,"Mini",2E-3,4.0000000000000001E-3,5.0000000000000001E-3,6.0000000000000001E-3,7.0000000000000001E-3,8.9999999999999993E-3,0.01,1.2E-2,1.4E-2,1.4999999999999999E-2,1.7000000000000001E-2,1.7999999999999999E-2,0.02]
["H6","Maxi",6.0000000000000001E-3,8.0000000000000002E-3,8.9999999999999993E-3,1.0999999999999999E-2,1.2999999999999999E-2,1.6E-2,1.9E-2,2.1999999999999999E-2,2.5000000000000001E-2,2.9000000000000001E-2,3.2000000000000001E-2,3.5999999999999997E-2,0.04]
[null,"Mini",0,0,0,0,0,0,0,0,0,0,0,0,0]
["H7","Maxi",0.01,1.2E-2,1.4999999999999999E-2,1.7999999999999999E-2,2.1000000000000001E-2,2.5000000000000001E-2,0.03,3.5000000000000003E-2,0.04,4.5999999999999999E-2,5.1999999999999998E-2,5.7000000000000002E-2,6.3E-2]
[null,"Mini",0,0,0,0,0,0,0,0,0,0,0,0,0]
["H8","Maxi",1.4E-2,1.7999999999999999E-2,2.1999999999999999E-2,2.7E-2,3.3000000000000002E-2,3.9E-2,4.5999999999999999E-2,5.3999999999999999E-2,6.3E-2,7.1999999999999995E-2,8.1000000000000003E-2,8.8999999999999996E-2,9.7000000000000003E-2]
[null,"Mini",0,0,0,0,0,0,0,0,0,0,0,0,0]
["H9","Maxi",2.5000000000000001E-2,0.03,3.5999999999999997E-2,4.2999999999999997E-2,5.1999999999999998E-2,6.2E-2,7.3999999999999996E-2,8.6999999999999994E-2,0.1,0.115,0.13,0.14000000000000001,0.155]
[null,"Mini",0,0,0,0,0,0,0,0,0,0,0,0,0]
["H10","Maxi",0.04,4.8000000000000001E-2,5.8000000000000003E-2,7.0000000000000007E-2,8.4000000000000005E-2,0.1,0.12,0.14000000000000001,0.16,0.185,0.21,0.23,0.25]
[null,"Mini",0,0,0,0,0,0,0,0,0,0,0,0,0]
["H11","Maxi",0.06,7.4999999999999997E-2,0.09,0.11,0.13,0.16,0.19,0.21,0.25,0.28999999999999998,0.32,0.36,0.4]
[null,"Mini",0,0,0,0,0,0,0,0,0,0,0,0,0]
["H12","Maxi",0.1,0.12,0.15,0.18,0.21,0.25,0.3,0.35,0.4,0.46,0.52,0.56999999999999995,0.63]
[null,"Mini",0,0,0,0,0,0,0,0,0,0,0,0,0]
["H13","Maxi",0.14000000000000001,0.18,0.22,0.27,0.33,0.39,0.46,0.54,0.63,0.72,0.81,0.89,0.97]
[null,"Mini",0,0,0,0,0,0,0,0,0,0,0,0,0]
["J7","Maxi",4.0000000000000001E-3,6.0000000000000001E-3,8.0000000000000002E-3,0.01,1.2E-2,1.4E-2,1.7999999999999999E-2,2.1999999999999999E-2,2.5999999999999999E-2,0.03,3.5999999999999997E-2,3.9E-2,4.2999999999999997E-2]
[null,"Mini",-6.0000000000000001E-3,-6.0000000000000001E-3,-7.0000000000000001E-3,-8.0000000000000002E-3,-8.9999999999999993E-3,-1.0999999999999999E-2,-1.2E-2,-1.2999999999999999E-2,-1.4E-2,-1.6E-2,-1.6E-2,-1.7999999999999999E-2,-0.02]
["JS13","Maxi",7.0000000000000007E-2,0.09,0.11,0.13500000000000001,0.16500000000000001,0.19500000000000001,0.23,0.27,0.315,0.36,0.40500000000000003,0.44500000000000001,0.48499999999999999]
[null,"Mini",-7.0000000000000007E-2,-0.09,-0.11,-0.13500000000000001,-0.16500000000000001,-0.19500000000000001,-0.23,-0.27,-0.315,-0.36,-0.40500000000000003,-0.44500000000000001,-0.48499999999999999]
["K6","Maxi",0,2E-3,2E-3,2E-3,2E-3,3.0000000000000001E-3,4.0000000000000001E-3,4.0000000000000001E-3,4.0000000000000001E-3,5.0000000000000001E-3,5.0000000000000001E-3,7.0000000000000001E-3,8.0000000000000002E-3]
[null,"Mini",-6.0000000000000001E-3,-6.0000000000000001E-3,-7.0000000000000001E-3,-8.9999999999999993E-3,-1.0999999999999999E-2,-1.2999999999999999E-2,-1.4999999999999999E-2,-1.7999999999999999E-2,-2.1000000000000001E-2,-2.4E-2,-2.7E-2,-2.9000000000000001E-2,-3.2000000000000001E-2]
{"$rows_left_out":15}
{"sheet":"Arbres","index":1,"n_rows":80,"n_cols":15,"rows_kept":80,"cut":false,"hidden":false,"merged":[[0,0,1,1],[68,0,69,0],[28,0,29,0],[30,0,31,0],[32,0,33,0],[38,0,39,0],[52,0,53,0],[54,0,55,0],[58,0,59,0],[60,0,61,0],[62,0,63,0],[64,0,65,0],[66,0,67,0],[26,0,27,0],[2,0,3,0],[16,0,17,0],[76,0,77,0],[78,0,79,0],[18,0,19,0],[20,0,21,0],[70,0,71,0],[72,0,73,0],[74,0,75,0],[22,0,23,0],[24,0,25,0],[36,0,37,0],[40,0,41,0],[34,0,35,0],[56,0,57,0],[48,0,49,0],[50,0,51,0],[4,0,5,0],[46,0,47,0],[44,0,45,0],[42,0,43,0],[12,0,13,0],[14,0,15,0],[10,0,11,0],[8,0,9,0],[6,0,7,0]]}
["Arbres",null,"≤ 3","3<D≤6","6<D≤10","10<D≤18","18<D≤30","30<D≤50","50<D≤80","80<D≤120","120<D≤180","180<D≤250","250<D≤315","315<D≤400","400<D≤500"]
[null,null,3,6,10,18,30,50,80,120,180,250,315,400,500]
["a11","Maxi",-0.27,-0.27,-0.28000000000000003,-0.28999999999999998,-0.3,-0.32,-0.36,-0.41,-0.57999999999999996,-0.82,-1.05,-1.35,-1.65]
[null,"Mini",-0.33,-0.34499999999999997,-0.37,-0.4,-0.43,-0.47,-0.53,-0.6,-0.71,-0.95,-1.24,-1.56,-1.9]
["c11","Maxi",-0.06,-7.0000000000000007E-2,-0.08,-9.5000000000000001E-2,-0.11,-0.13,-0.15,-0.18,-0.23,-0.28000000000000003,-0.33,-0.4,-0.48]
[null,"Mini",-0.12,-0.14499999999999999,-0.17,-0.20499999999999999,-0.24,-0.28000000000000003,-0.33,-0.39,-0.45,-0.53,-0.62,-0.72,-0.84]
["d9","Maxi",-0.02,-0.03,-0.04,-0.05,-6.5000000000000002E-2,-0.08,-0.1,-0.12,-0.14499999999999999,-0.17,-0.19,-0.21,-0.23]
[null,"Mini",-4.4999999999999998E-2,-0.06,-7.4999999999999997E-2,-9.2999999999999999E-2,-0.11700000000000001,-0.14199999999999999,-0.17399999999999999,-0.20699999999999999,-0.245,-0.28499999999999998,-0.32,-0.35,-0.38500000000000001]
["d10","Maxi",-0.02,-0.03,-0.04,-0.05,-6.5000000000000002E-2,-0.08,-0.1,-0.12,-0.14499999999999999,-0.17,-0.19,-0.21,-0.23]
[null,"Mini",-0.06,-7.8E-2,-9.8000000000000004E-2,-0.12,-0.14899999999999999,-0.18,-0.22,-0.25,-0.30499999999999999,-0.35499999999999998,-0.4,-0.44,-0.48]
["d11","Maxi",-0.02,-0.03,-0.04,-0.05,-6.5000000000000002E-2,-0.08,-0.1,-0.12,-0.14499999999999999,-0.17,-0.19,-0.21,-0.23]
[null,"Mini",-0.08,-0.105,-0.13,-0.16,-0.19500000000000001,-0.24,-0.28999999999999998,-0.34,-0.39500000000000002,-0.46,-0.51,-0.56999999999999995,-0.63]
["e7","Maxi",-1.4E-2,-0.02,-2.5000000000000001E-2,-3.2000000000000001E-2,-0.04,-0.05,-0.06,-7.1999999999999995E-2,-8.5000000000000006E-2,-0.1,-0.11,-0.125,-0.13500000000000001]
[null,"Mini",-2.4E-2,-3.2000000000000001E-2,-0.04,-0.05,-6.0999999999999999E-2,-7.4999999999999997E-2,-0.09,-0.107,-0.125,-0.14599999999999999,-0.16200000000000001,-0.182,-0.19800000000000001]
["e8","Maxi",-0.14000000000000001,-0.02,-2.5000000000000001E-2,-3.2000000000000001E-2,-0.04,-0.05,-0.06,-7.1999999999999995E-2,-8.5000000000000006E-2,-0.1,-0.11,-0.125,-0.13500000000000001]
[null,"Mini",-2.8000000000000001E-2,-3.7999999999999999E-2,-4.7E-2,-5.8999999999999997E-2,-7.2999999999999995E-2,-8.8999999999999996E-2,-0.106,-0.126,-0.14799999999999999,-0.17199999999999999,-0.191,-0.214,-0.23200000000000001]
["e9","Maxi",-1.4E-2,-0.02,-2.5000000000000001E-2,-3.2000000000000001E-2,-0.04,-0.05,-0.06,-7.1999999999999995E-2,-8.5000000000000006E-2,-0.1,-0.11,-0.125,-0.13500000000000001]
[null,"Mini",-3.9E-2,-0.05,-6.0999999999999999E-2,-7.4999999999999997E-2,-9.1999999999999998E-2,-0.112,-0.13400000000000001,-0.159,-0.185,-0.215,-0.24,-0.26500000000000001,-0.28999999999999998]
["f6","Maxi",-6.0000000000000001E-3,-0.01,-1.2999999999999999E-2,-1.6E-2,-0.02,-2.5000000000000001E-2,-0.03,-3.5999999999999997E-2,-4.2999999999999997E-2,-0.05,-5.6000000000000001E-2,-6.2E-2,-6.8000000000000005E-2]
[null,"Mini",-1.2E-2,-1.7999999999999999E-2,-2.1999999999999999E-2,-2.7E-2,-3.3000000000000002E-2,-4.1000000000000002E-2,-4.9000000000000002E-2,-5.8000000000000003E-2,-6.8000000000000005E-2,-7.9000000000000001E-2,-8.7999999999999995E-2,-9.8000000000000004E-2,-0.108]
["f7","Maxi",-6.0000000000000001E-3,-0.01,-1.2999999999999999E-2,-1.6E-2,-0.02,-2.5000000000000001E-2,-0.03,-3.5999999999999997E-2,-4.2999999999999997E-2,-0.05,-5.6000000000000001E-2,-6.2E-2,-6.8000000000000005E-2]
[null,"Mini",-1.6E-2,-2.1999999999999999E-2,-2.8000000000000001E-2,-3.4000000000000002E-2,-4.1000000000000002E-2,-0.05,-0.06,-7.0999999999999994E-2,-8.3000000000000004E-2,-9.6000000000000002E-2,-0.106,-0.11899999999999999,-0.13100000000000001]
["g5","Maxi",-2E-3,4.0000000000000001E-3,-5.0000000000000001E-3,-6.0000000000000001E-3,-7.0000000000000001E-3,-8.9999999999999993E-3,-0.01,-1.2E-2,-1.4E-2,-1.4999999999999999E-2,-1.4E-2,-1.7999999999999999E-2,-0.02]
[null,"Mini",-6.0000000000000001E-3,-8.9999999999999993E-3,-1.0999999999999999E-2,-1.4E-2,-1.6E-2,-0.02,-2.3E-2,-2.7E-2,-3.2000000000000001E-2,-3.5000000000000003E-2,-0.04,-4.2999999999999997E-2,{"$f":"-M24","v":0.04}]
["g6","Maxi",-2E-3,4.0000000000000001E-3,-5.0000000000000001E-3,-6.0000000000000001E-3,-7.0000000000000001E-3,-8.9999999999999993E-3,-0.01,-1.2E-2,-1.4E-2,-1.4999999999999999E-2,-1.4E-2,-1.7999999999999999E-2,-0.02]
[null,"Mini",-8.0000000000000002E-3,-1.2E-2,-1.4E-2,-1.7000000000000001E-2,-0.02,-2.5000000000000001E-2,-2.9000000000000001E-2,-3.4000000000000002E-2,-3.9E-2,-4.3999999999999997E-2,-4.9000000000000002E-2,-5.3999999999999999E-2,{"$f":"-0.06","v":-0.06}]
["h5","Maxi",0,0,0,0,0,0,0,0,0,0,0,0,0]
[null,"Mini",-4.0000000000000001E-3,-5.0000000000000001E-3,-6.0000000000000001E-3,-8.0000000000000002E-3,-8.9999999999999993E-3,-1.0999999999999999E-2,-1.2999999999999999E-2,-1.4999999999999999E-2,-1.7999999999999999E-2,-0.02,-2.3E-2,-2.5000000000000001E-2,-2.7E-2]
["h6","Maxi",0,0,0,0,0,0,0,0,0,0,0,0,0]
[null,"Mini",-6.0000000000000001E-3,-8.0000000000000002E-3,-8.9999999999999993E-3,-1.0999999999999999E-2,-1.2999999999999999E-2,-1.6E-2,-1.9E-2,-2.1999999999999999E-2,-2.5000000000000001E-2,-2.9000000000000001E-2,-3.2000000000000001E-2,-3.5999999999999997E-2,-0.04]
{"$rows_left_out":51}
{"sheet":"Calcul ajustement","index":2,"n_rows":24,"n_cols":3,"rows_kept":24,"cut":false,"hidden":false,"merged":[[22,0,22,1],[23,0,23,1],[2,1,6,1],[0,0,0,1],[1,0,1,1],[2,0,12,0],[13,1,15,1],[13,0,21,0]]}
["Cote nominale",null,15]
["Ajustement",null,"H11e8"]
["ALESAGE","Tolérance alésage","H11"]
[null,null,"H"]
[null,null,11]
[null,null,11]
[null,null,"H11"]
[null,"N° ligne écart sup",19]
[null,"N° colonne écart sup",6]
[null,"Valeur écart sup",0.11]
[null,"Valeur écart inf",0]
[null,"Cote maxi ",15.11]
[null,"Cote mini",15]
["Arbre","Tolérance arbre",100000000]
[null,null,1]
[null,null,"e8"]
[null,"N° ligne écart sup",15]
[null,"N° colonne écart sup",6]
[null,"Valeur écart sup",-3.2000000000000001E-2]
[null,"Valeur écart inf",-5.8999999999999997E-2]
[null,"Cote maxi ",14.968]
[null,"Cote mini",14.941000000000001]
["Jeu maxi",null,0.16899999999999871]
["Jeu mini",null,3.2000000000000028E-2]

{"sheet":"Calcul courbes","index":3,"n_rows":13,"n_cols":4,"rows_kept":13,"cut":false,"hidden":false,"merged":[[1,0,2,0],[3,0,5,0]]}
[null,null,"Jmaxi","Jmini"]
["Paramètres de courbe","b",{"$f":"1/(2*'Calcul ajustement'!$C$1+'Calcul ajustement'!$C$23)","v":3.3146607444728034E-2}]
[null,"c",{"$f":"'Calcul ajustement'!$C$23/(2*'Calcul ajustement'!$C$1+'Calcul ajustement'!$C$23)","v":5.6017766581589953E-3}]
["Point d'inflexion","f''(xinfl)",{"$f":"(-1+2*C2*C5/SQRT(C2^2*C5^2+C3)-(C2^3)*(C5^3)/(C2^2*C5^2+C3)^(3/2))-(4*(C2^3)*(C5^3)/SQRT(C2^2*C5^2+C3)-4*(C2^2)*(C5^2)-2*(C2^4)*(C5^4)/(C2^2*C5^2+C3)+2*(C2^3)*(C5^3)/SQRT(C2^2*C5^2+C3)-2*(C2^2)*(C5^2)+2*C2*C5*SQRT(C2^2*C5^2+C3)/(1+(-C2*C5+SQRT(C2^2*C5^2+C3))^2))","v":-0.114897942107951}]
[null,"xinfl",1.3348587779911414]
[null,"yinfl",{"$f":"4*ATAN(-$C$2*C5+SQRT(($C$2)^2*C5^2+$C$3))","v":0.17069343386628255}]
["Pente tangente au point d'inflexion","f'(xinfl)",{"$f":"4*(-$C$2*$C$5+($C$2^2)*($C$5^2)/SQRT($C$2^2*$C$5^2+$C$3))/(1+(-$C$2*$C$5+SQRT($C$2^2*$C$5^2+$C$3))^2)","v":-8.6759620694054879E-2}]
["Pente asymptote intermédiaire au point d'inflexion","a",{"$f":"LN(10^C7)","v":-0.19977140928394851}]
["Constante asymptote intermédiaire","d",{"$f":"C6-C8*LOG(C5)","v":0.19575182486486886}]
["y première asyptote",null,{"$f":"2*ACOS('Calcul ajustement'!$C$22/'Calcul ajustement'!$C$12)","v":0.29940684993084954}]
["Abscisse point de rencontre 1ère et 2nde asymptotes","y première asyptote=a.logx+d",{"$f":"10^((C10-C9)/C8)","v":0.30278324035264231}]
["Abscisse point de rotulage critique","xCritique (mm)",{"$f":"10^(-C9/C8)","v":9.547267271760866}]
["Ordonnée point de rotulage critique (pour l'affichage)","ycritique ",0.01]

{"sheet":"Graphique1","index":4,"n_rows":610,"n_cols":9,"rows_kept":610,"cut":false,"hidden":false,"merged":[[8,4,8,5]]}
[]
[null,null,null,null,{"$f":"VLOOKUP('Calcul courbes'!$C$11,$B$10:$C$600,1)","v":0.30199517204016685},{"$f":"VLOOKUP('Calcul courbes'!$C$12,$B$10:$C$600,1)","v":9.3325430079681944}]
[null,null,null,null,{"$f":"MATCH(E2,$B$10:$B$600,0)+8","v":257},{"$f":"MATCH(F2,$B$10:$B$600,0)+10","v":408}]
[null,null,null,null,{"$f":"ROW($B$10)","v":10},{"$f":"ROW($B$10)","v":10}]
[null,null,null,null,{"$f":"E3-E4","v":247},{"$f":"F3-F4","v":398}]
[]
[]
[]
["Pas","L","a","Ordonnée asymptote intermédiaire","Abscisses asymptote intermédiaire",null,"Ordonnée première asymptote","Ordonnée dernière asymptote","Longueur critique"]
[-3,{"$f":"10^A10","v":1E-3},{"$f":"4*ATAN(-'Calcul courbes'!$C$2*B10+SQRT(('Calcul courbes'!$C$2)^2*B10^2+'Calcul courbes'!$C$3))","v":0.29869110270738986},{"$f":"IF(ROW()>$E$3+1,('Calcul courbes'!$C$8*LOG(B10)+'Calcul courbes'!$C$9),NA())","v":{"$error":"#N/A"}},{"$f":"IF(ROW()<$F$3+1,B10,NA())","v":1E-3},{"$f":"IF(ROW()>$E$3+1,E10,NA())","v":{"$error":"#N/A"}},{"$f":"IF(ROW()<$E$3+1,'Calcul courbes'!$C$10,NA())","v":0.29940684993084954},{"$f":"IF(ROW()>$F$3-1,0,NA())","v":{"$error":"#N/A"}},{"$f":"IF(ROW()=$F$3-1,0,NA())","v":{"$error":"#N/A"}}]
[-2.99,{"$f":"10^A11","v":1.0232929922807533E-3},{"$f":"4*ATAN(-'Calcul courbes'!$C$2*B11+SQRT(('Calcul courbes'!$C$2)^2*B11^2+'Calcul courbes'!$C$3))","v":0.2986880329371297},{"$f":"IF(ROW()>$E$3+1,('Calcul courbes'!$C$8*LOG(B11)+'Calcul courbes'!$C$9),NA())","v":{"$error":"#N/A"}},{"$f":"IF(ROW()<$F$3+1,B11,NA())","v":1.0232929922807533E-3},{"$f":"IF(ROW()>$E$3+1,E11,NA())","v":{"$error":"#N/A"}},{"$f":"IF(ROW()<$E$3+1,'Calcul courbes'!$C$10,NA())","v":0.29940684993084954},{"$f":"IF(ROW()>$F$3-1,0,NA())","v":{"$error":"#N/A"}},{"$f":"IF(ROW()=$F$3-1,0,NA())","v":{"$error":"#N/A"}}]
[-2.98,1.0471285480508988E-3,{"$f":"4*ATAN(-'Calcul courbes'!$C$2*B12+SQRT(('Calcul courbes'!$C$2)^2*B12^2+'Calcul courbes'!$C$3))","v":0.29868489169516649},{"$f":"IF(ROW()>$E$3+1,('Calcul courbes'!$C$8*LOG(B12)+'Calcul courbes'!$C$9),NA())","v":{"$error":"#N/A"}},1.0471285480508988E-3,{"$error":"#N/A"},{"$f":"IF(ROW()<$E$3+1,'Calcul courbes'!$C$10,NA())","v":0.29940684993084954},{"$error":"#N/A"},{"$error":"#N/A"}]
[-2.97,1.0715193052376053E-3,{"$f":"4*ATAN(-'Calcul courbes'!$C$2*B13+SQRT(('Calcul courbes'!$C$2)^2*B13^2+'Calcul courbes'!$C$3))","v":0.29868167731823875},{"$f":"IF(ROW()>$E$3+1,('Calcul courbes'!$C$8*LOG(B13)+'Calcul courbes'!$C$9),NA())","v":{"$error":"#N/A"}},1.0715193052376053E-3,{"$error":"#N/A"},{"$f":"IF(ROW()<$E$3+1,'Calcul courbes'!$C$10,NA())","v":0.29940684993084954},{"$error":"#N/A"},{"$error":"#N/A"}]
[-2.96,1.0964781961431849E-3,{"$f":"4*ATAN(-'Calcul courbes'!$C$2*B14+SQRT(('Calcul courbes'!$C$2)^2*B14^2+'Calcul courbes'!$C$3))","v":0.29867838810441488},{"$f":"IF(ROW()>$E$3+1,('Calcul courbes'!$C$8*LOG(B14)+'Calcul courbes'!$C$9),NA())","v":{"$error":"#N/A"}},1.0964781961431849E-3,{"$error":"#N/A"},{"$f":"IF(ROW()<$E$3+1,'Calcul courbes'!$C$10,NA())","v":0.29940684993084954},{"$error":"#N/A"},{"$error":"#N/A"}]
[-2.95,1.1220184543019622E-3,{"$f":"4*ATAN(-'Calcul courbes'!$C$2*B15+SQRT(('Calcul courbes'!$C$2)^2*B15^2+'Calcul courbes'!$C$3))","v":0.29867502231219561},{"$f":"IF(ROW()>$E$3+1,('Calcul courbes'!$C$8*LOG(B15)+'Calcul courbes'!$C$9),NA())","v":{"$error":"#N/A"}},1.1220184543019622E-3,{"$error":"#N/A"},{"$f":"IF(ROW()<$E$3+1,'Calcul courbes'!$C$10,NA())","v":0.29940684993084954},{"$error":"#N/A"},{"$error":"#N/A"}]
[-2.94,1.1481536214968825E-3,{"$f":"4*ATAN(-'Calcul courbes'!$C$2*B16+SQRT(('Calcul courbes'!$C$2)^2*B16^2+'Calcul courbes'!$C$3))","v":0.29867157815959589},{"$f":"IF(ROW()>$E$3+1,('Calcul courbes'!$C$8*LOG(B16)+'Calcul courbes'!$C$9),NA())","v":{"$error":"#N/A"}},1.1481536214968825E-3,{"$error":"#N/A"},{"$f":"IF(ROW()<$E$3+1,'Calcul courbes'!$C$10,NA())","v":0.29940684993084954},{"$error":"#N/A"},{"$error":"#N/A"}]
[-2.93,1.174897554939528E-3,{"$f":"4*ATAN(-'Calcul courbes'!$C$2*B17+SQRT(('Calcul courbes'!$C$2)^2*B17^2+'Calcul courbes'!$C$3))","v":0.2986680538232056},{"$f":"IF(ROW()>$E$3+1,('Calcul courbes'!$C$8*LOG(B17)+'Calcul courbes'!$C$9),NA())","v":{"$error":"#N/A"}},1.174897554939528E-3,{"$error":"#N/A"},{"$f":"IF(ROW()<$E$3+1,'Calcul courbes'!$C$10,NA())","v":0.29940684993084954},{"$error":"#N/A"},{"$error":"#N/A"}]
[-2.92,1.2022644346174124E-3,{"$f":"4*ATAN(-'Calcul courbes'!$C$2*B18+SQRT(('Calcul courbes'!$C$2)^2*B18^2+'Calcul courbes'!$C$3))","v":0.29866444743722853},{"$f":"IF(ROW()>$E$3+1,('Calcul courbes'!$C$8*LOG(B18)+'Calcul courbes'!$C$9),NA())","v":{"$error":"#N/A"}},1.2022644346174124E-3,{"$error":"#N/A"},{"$f":"IF(ROW()<$E$3+1,'Calcul courbes'!$C$10,NA())","v":0.29940684993084954},{"$error":"#N/A"},{"$error":"#N/A"}]
[-2.91,1.2302687708123808E-3,{"$f":"4*ATAN(-'Calcul courbes'!$C$2*B19+SQRT(('Calcul courbes'!$C$2)^2*B19^2+'Calcul courbes'!$C$3))","v":0.29866075709249934},{"$f":"IF(ROW()>$E$3+1,('Calcul courbes'!$C$8*LOG(B19)+'Calcul courbes'!$C$9),NA())","v":{"$error":"#N/A"}},1.2302687708123808E-3,{"$error":"#N/A"},{"$f":"IF(ROW()<$E$3+1,'Calcul courbes'!$C$10,NA())","v":0.29940684993084954},{"$error":"#N/A"},{"$error":"#N/A"}]
[-2.9,1.2589254117941662E-3,{"$f":"4*ATAN(-'Calcul courbes'!$C$2*B20+SQRT(('Calcul courbes'!$C$2)^2*B20^2+'Calcul courbes'!$C$3))","v":0.29865698083547731},{"$f":"IF(ROW()>$E$3+1,('Calcul courbes'!$C$8*LOG(B20)+'Calcul courbes'!$C$9),NA())","v":{"$error":"#N/A"}},1.2589254117941662E-3,{"$error":"#N/A"},{"$f":"IF(ROW()<$E$3+1,'Calcul courbes'!$C$10,NA())","v":0.29940684993084954},{"$error":"#N/A"},{"$error":"#N/A"}]
[-2.89,1.288249551693133E-3,{"$f":"4*ATAN(-'Calcul courbes'!$C$2*B21+SQRT(('Calcul courbes'!$C$2)^2*B21^2+'Calcul courbes'!$C$3))","v":0.29865311666721739},{"$f":"IF(ROW()>$E$3+1,('Calcul courbes'!$C$8*LOG(B21)+'Calcul courbes'!$C$9),NA())","v":{"$error":"#N/A"}},1.288249551693133E-3,{"$error":"#N/A"},{"$f":"IF(ROW()<$E$3+1,'Calcul courbes'!$C$10,NA())","v":0.29940684993084954},{"$error":"#N/A"},{"$error":"#N/A"}]
[-2.88,1.3182567385564071E-3,{"$f":"4*ATAN(-'Calcul courbes'!$C$2*B22+SQRT(('Calcul courbes'!$C$2)^2*B22^2+'Calcul courbes'!$C$3))","v":0.29864916254231727},{"$f":"IF(ROW()>$E$3+1,('Calcul courbes'!$C$8*LOG(B22)+'Calcul courbes'!$C$9),NA())","v":{"$error":"#N/A"}},1.3182567385564071E-3,{"$error":"#N/A"},{"$f":"IF(ROW()<$E$3+1,'Calcul courbes'!$C$10,NA())","v":0.29940684993084954},{"$error":"#N/A"},{"$error":"#N/A"}]
[-2.87,1.3489628825916523E-3,{"$f":"4*ATAN(-'Calcul courbes'!$C$2*B23+SQRT(('Calcul courbes'!$C$2)^2*B23^2+'Calcul courbes'!$C$3))","v":0.29864511636784025},{"$f":"IF(ROW()>$E$3+1,('Calcul courbes'!$C$8*LOG(B23)+'Calcul courbes'!$C$9),NA())","v":{"$error":"#N/A"}},1.3489628825916523E-3,{"$error":"#N/A"},{"$f":"IF(ROW()<$E$3+1,'Calcul courbes'!$C$10,NA())","v":0.29940684993084954},{"$error":"#N/A"},{"$error":"#N/A"}]
[-2.86,1.3803842646028844E-3,{"$f":"4*ATAN(-'Calcul courbes'!$C$2*B24+SQRT(('Calcul courbes'!$C$2)^2*B24^2+'Calcul courbes'!$C$3))","v":0.29864097600221268},{"$f":"IF(ROW()>$E$3+1,('Calcul courbes'!$C$8*LOG(B24)+'Calcul courbes'!$C$9),NA())","v":{"$error":"#N/A"}},1.3803842646028844E-3,{"$error":"#N/A"},{"$f":"IF(ROW()<$E$3+1,'Calcul courbes'!$C$10,NA())","v":0.29940684993084954},{"$error":"#N/A"},{"$error":"#N/A"}]
[-2.85,1.4125375446227527E-3,{"$f":"4*ATAN(-'Calcul courbes'!$C$2*B25+SQRT(('Calcul courbes'!$C$2)^2*B25^2+'Calcul courbes'!$C$3))","v":0.29863673925409717},{"$f":"IF(ROW()>$E$3+1,('Calcul courbes'!$C$8*LOG(B25)+'Calcul courbes'!$C$9),NA())","v":{"$error":"#N/A"}},1.4125375446227527E-3,{"$error":"#N/A"},{"$f":"IF(ROW()<$E$3+1,'Calcul courbes'!$C$10,NA())","v":0.29940684993084954},{"$error":"#N/A"},{"$error":"#N/A"}]
[-2.84,1.4454397707459271E-3,{"$f":"4*ATAN(-'Calcul courbes'!$C$2*B26+SQRT(('Calcul courbes'!$C$2)^2*B26^2+'Calcul courbes'!$C$3))","v":0.29863240388123857},{"$f":"IF(ROW()>$E$3+1,('Calcul courbes'!$C$8*LOG(B26)+'Calcul courbes'!$C$9),NA())","v":{"$error":"#N/A"}},1.4454397707459271E-3,{"$error":"#N/A"},{"$f":"IF(ROW()<$E$3+1,'Calcul courbes'!$C$10,NA())","v":0.29940684993084954},{"$error":"#N/A"},{"$error":"#N/A"}]
[-2.83,1.4791083881682066E-3,{"$f":"4*ATAN(-'Calcul courbes'!$C$2*B27+SQRT(('Calcul courbes'!$C$2)^2*B27^2+'Calcul courbes'!$C$3))","v":0.298627967589284},{"$f":"IF(ROW()>$E$3+1,('Calcul courbes'!$C$8*LOG(B27)+'Calcul courbes'!$C$9),NA())","v":{"$error":"#N/A"}},1.4791083881682066E-3,{"$error":"#N/A"},{"$f":"IF(ROW()<$E$3+1,'Calcul courbes'!$C$10,NA())","v":0.29940684993084954},{"$error":"#N/A"},{"$error":"#N/A"}]
[-2.82,1.5135612484362072E-3,{"$f":"4*ATAN(-'Calcul courbes'!$C$2*B28+SQRT(('Calcul courbes'!$C$2)^2*B28^2+'Calcul courbes'!$C$3))","v":0.29862342803057551},{"$f":"IF(ROW()>$E$3+1,('Calcul courbes'!$C$8*LOG(B28)+'Calcul courbes'!$C$9),NA())","v":{"$error":"#N/A"}},1.5135612484362072E-3,{"$error":"#N/A"},{"$f":"IF(ROW()<$E$3+1,'Calcul courbes'!$C$10,NA())","v":0.29940684993084954},{"$error":"#N/A"},{"$error":"#N/A"}]
[-2.81,1.5488166189124802E-3,{"$f":"4*ATAN(-'Calcul courbes'!$C$2*B29+SQRT(('Calcul courbes'!$C$2)^2*B29^2+'Calcul courbes'!$C$3))","v":0.29861878280291482},{"$f":"IF(ROW()>$E$3+1,('Calcul courbes'!$C$8*LOG(B29)+'Calcul courbes'!$C$9),NA())","v":{"$error":"#N/A"}},1.5488166189124802E-3,{"$error":"#N/A"},{"$f":"IF(ROW()<$E$3+1,'Calcul courbes'!$C$10,NA())","v":0.29940684993084954},{"$error":"#N/A"},{"$error":"#N/A"}]
[-2.8,1.5848931924611134E-3,{"$f":"4*ATAN(-'Calcul courbes'!$C$2*B30+SQRT(('Calcul courbes'!$C$2)^2*B30^2+'Calcul courbes'!$C$3))","v":0.2986140294482999},{"$f":"IF(ROW()>$E$3+1,('Calcul courbes'!$C$8*LOG(B30)+'Calcul courbes'!$C$9),NA())","v":{"$error":"#N/A"}},1.5848931924611134E-3,{"$error":"#N/A"},{"$f":"IF(ROW()<$E$3+1,'Calcul courbes'!$C$10,NA())","v":0.29940684993084954},{"$error":"#N/A"},{"$error":"#N/A"}]
{"$rows_left_out":580}